SEA ICE ELEVATION
type: Concept
in scheme: sciencekeywords
definition: Pertains to the measurement of the surface height of the sea ice. In particular, sea ice elevation is measured by the radar altimeter on board the NASA IceSat satellite.

SEA ICE
type: Concept