DOC/NOAA/OAR/PMEL/NCTR
type: Concept
in scheme: providers
definition: - Research in support of improved measurement technology and the design of optimal tsunami monitoring networks - Research, development and implementation of improved models to increase the speed and accuracy of operational forecasts and warnings - Research and development of improved methods to predict tsunami impacts on the population and infrastructure of coastal communities Summary provided by http://nctr.pmel.noaa.gov/

NOAA
type: Concept