MICROFOSSILS
type: Concept
in scheme: sciencekeywords
definition: Microfossils are fossils too small to be seen without the aid of a microscope, e.g., a foraminifer or ostracode. It may be the remains of microscopic organisms or a part of a larger orgnaism.

OCEAN/LAKE RECORDS
type: Concept