Imaging Radars
type: Concept

BRLK
type: Concept
change note: 2015-08-03 12:39:57.0 [mpmorahan] insert AltLabel (id: null text: X-band Synthetic Aperture Radar language code: en);
change note: 2015-08-03 12:38:58.0 [mpmorahan] Insert Concept add broader relation (BRLK [6efe4ae6-fbf2-4e92-8fe4-78e16182da84,158163] - Imaging Radars [824070fa-da29-40fa-ba17-f3d60584bd4d,145571]);
in scheme: instruments
definition: X-band Synthetic Aperture Radar (BRLK) Group: Instrument_Details Entry_ID: BRLK Group: Instrument_Identification Instrument_Category: Earth Remote Sensing Instruments Instrument_Class: Active Remote Sensing Instrument_Type: Imaging Radars Short_Name: BRLK Long_Name: X-band Synthetic Aperture Radar End_Group Group: Associated_Platforms Short_Name: Meteor-M N1 Short_Name: Meteor-M N2 End_Group Group: Spectral_Frequency_Information Wavelength_Keyword: X-Ray End_Group Creation_Date: 2015-01-26 Group: Instrument_Logistics Instrument_Owner: Russia/ROSHYDROMET End_Group End_Group