PLANETARY/ROSSBY WAVES
type: Concept
in scheme: sciencekeywords
definition: A wave on a uniform current in a two-dimensional nondivergent fluid system, rotating with varying angle speed about the local vertical (beta plane).

ATMOSPHERIC PRESSURE
type: Concept