COMMERCIAL
type: Concept

WGBH/EF/TD
type: Concept
in scheme: providers
definition: Featuring public television content, Teachers' Domain provides multimedia class- room resources and professional development courses to K-12 educators. Information provided by http://www.teachersdomain.org/