PISCES
type: Concept
in scheme: providers
definition: Pisces staff include experts in invertebrate taxonomy, lake and river life, and fish ecology. The Pisces reputation is underlined by the number and variety of projects with which staff have been involved and by a long list of scientific and expert publications from over thirty years of research. Two have written books on aquatic ecology, taxonomy and ecological methodologies. Members of staff regularly teach at Southampton and the University of Oxford. Summary Provided By: http://www.irchouse.demon.co.uk/

COMMERCIAL
type: Concept