TROPICAL CYCLONES
type: Concept

SEVERE TROPICAL CYCLONES
type: Concept
change note: 2012-07-02 09:07:10.0 [tbs1979] insert Definition (id: null text: A severe tropical cyclone in the North Indian Ocean. language code: en);
change note: 2012-06-27 14:53:21.0 [tbs1979] Insert Concept add broader relation (SEVERE TROPICAL CYCLONES [6f7996f7-5905-42e7-b9fd-c24c6328b5d9,40231] - TROPICAL CYCLONES [00fc45e0-400d-4024-a82a-4d6544735f64,40225]);
in scheme: sciencekeywords
definition: A severe tropical cyclone in the North Indian Ocean.