Probes
type: Concept

Zhangheng LAP
type: Concept
change note: 2021-08-06 08:49:42.0 [mmorahan] insert AltLabel (id: null category: primary text: Langmuir Probe language code: en); insert Definition (id: null text: The Langmuir Probe, realized by the Center for Space Science and Applied Research of the Chinese Academy of Science, allows to: - monitor the global parameters of the ionosphere in situ - study the coupling between lithosphere and ionosphere before, during and after earthquakes. The LP consists of a pair of spherical Langmuir Probes with diameters of 5 cm and 1 cm, respectively, installed at the tip of booms 50 cm long. The LP has been tested in an Electronics test facility for an electronics calibration and in the INAF-IAPS Plasma Chamber. language code: en); insert WeightedRelation (id: null related concept uuid: 52ae802c-b2fd-4548-aefd-ec4e4325b803 relationship type: null relationship value: null generated by: null);
change note: 2021-08-06 08:47:07.0 [mmorahan] Insert Concept add broader relation (Zhangheng LAP [6fcdd7f4-a96b-4c42-a60e-225419d86443,692298] - Probes [a172d205-122a-4a8b-b73a-52c1d44d6aaa,684582]);
in scheme: instruments
definition: The Langmuir Probe, realized by the Center for Space Science and Applied Research of the Chinese Academy of Science, allows to: - monitor the global parameters of the ionosphere in situ - study the coupling between lithosphere and ionosphere before, during and after earthquakes. The LP consists of a pair of spherical Langmuir Probes with diameters of 5 cm and 1 cm, respectively, installed at the tip of booms 50 cm long. The LP has been tested in an Electronics test facility for an electronics calibration and in the INAF-IAPS Plasma Chamber.