LANCASTER-U/DCS
type: Concept
in scheme: providers
definition: The data archive at Lancaster contains a number of datasets of interest to researchers in the area of solar-terrestrial physics: User-defined plot and data request Access to data and user-defined plots is available with our automated multi-instrument data request. This includes data/plots from IRIS, with access to DASI, SCASI and energy map data coming soon. Summary plots Summary plots of data held at Lancaster, with the option to include plots produced by our collaborators. STP events database The STP events database contains details of various events relevent to solar-terrestrial physics, including riometer absorption events, times of substorm onsets, solar flares in addition to indices such as Kp and Dst. [Source: Department of Communication Systems, Lancaster University Homepage]

ACADEMIC
type: Concept