LWCC
type: Concept
change note: 2020-04-15 09:21:08.0 [tstevens] insert AltLabel (id: null category: primary text: Liquid Waveguide Capillary Cells language code: en); insert Definition (id: null text: WPI’s Liquid Waveguide Capillary Cell (LWCC) is a flow cell for absorbance measurements in the ultraviolet, visible and near infra-red ranges. Pathlengths range from 50–500cm, with increasing measurement sensitivity from 50 to 500-fold. The flow cells are fiber coupled and have a very small sample volume ranging from 125μL (50cm pathlength) to 1,250μL (500cm pathlength). language code: en);
change note: 2020-04-15 09:20:11.0 [tstevens] Insert Concept add broader relation (LWCC [706feedf-c671-44e8-9c37-284517cc0cbe,559949] - Spectrometers [055a79c7-61db-4250-abad-f1e09909f14c,543071]);
in scheme: instruments
definition: WPI’s Liquid Waveguide Capillary Cell (LWCC) is a flow cell for absorbance measurements in the ultraviolet, visible and near infra-red ranges. Pathlengths range from 50–500cm, with increasing measurement sensitivity from 50 to 500-fold. The flow cells are fiber coupled and have a very small sample volume ranging from 125μL (50cm pathlength) to 1,250μL (500cm pathlength).

Spectrometers
type: Concept