SCO
type: Concept
in scheme: providers
definition: Social Change Online (SCO) supports organisations to make the most of new technologies. We provide a full set of internet services, ranging from website development and back end technology integration, to strategic planning services and content development. Information technology growth has created new communication channels and improved service delivery and information access - for government, membership organisations and community groups. SCO has developed over 300 sites, since 1996, for organisations ranging from the NSW Premier's Department and the Federal Court to the Superannuation Trust of Australia and the Australian Council of Trade Unions. Summary provided by http://online.socialchange.net.au/site/about/

COMMERCIAL
type: Concept