BOPS
type: Concept
in scheme: instruments
definition: Bio-Optical Profiling System (BOPS) is an instrument package for measuring optical and physical parameters in the water column.

Profilers/Sounders
type: Concept