MAST
type: Concept
in scheme: providers
definition: The Mountain Area Safety Taskforce provides the general public with information on vegetation mortality and related fire hazard conditions in the San Bernardino-San Jacinto Mountain area of inland Southern California, and to provide access to fire prevention, emergency preparedness, and wildfire recovery guidance and programs maintained by the San Bernardino and Riverside County Mountain Area Safety Taskforce (MAST) organizations and their member agencies. Website: http://www.calmast.org/ [Summary provided by MAST.]

CONSORTIA/INSTITUTIONS
type: Concept