Photon/Optical Detectors
type: Concept

OCM-2
type: Concept
change note: 2019-02-22 08:31:11.0 [mmorahan] insert WeightedRelation (id: null related concept uuid: df967339-0096-4445-8732-0071f1de9e27 relationship type: null relationship value: null generated by: null);
change note: 2015-11-02 08:39:24.0 [mpmorahan] mmorahan insert AltLabel (id: null text: Ocean Colour Monitor-2 language code: en);
change note: 2015-11-02 08:38:15.0 [mpmorahan] Insert Concept add broader relation (OCM-2 [715bd84e-47a5-4da8-baf4-a283c46ccadf,158459] - Photon/Optical Detectors [72227178-bb4c-4ff5-98a3-f976aa3f3714,144761]);
in scheme: instruments
definition: The OCM-2 sensor consists of 8-band modular cameras operating in the Visible-Near IR spectral range. This sensor provides an instantaneous geometric field of view of 360 m and covers a swath width of 1420 km. The wide swath enables the OCM-2 to provide a revisit cycle of two days for a given area. Group: Instrument_Details Entry_ID: OCM-2 Group: Instrument_Identification Instrument_Category: Earth Remote Sensing Instruments Instrument_Class: Passive Remote Sensing Instrument_Type: Photon/Optical Detectors Short_Name: OCM-2 Long_Name: Ocean Colour Monitor-2 End_Group Group: Associated_Platforms Short_Name: IRS-O2 End_Group Group: Spectral_Frequency_Information Wavelength_Keyword: VISIBLE Number_Channels: 8 Spectral_Frequency_Coverage_Range: 0.40-0.885 micron Spectral_Frequency_Resolution: 20 nm End_Group Creation_Date: 2015-10-28 End_Group