IVS
type: Concept
in scheme: providers
definition: Interactive Visualization Systems (IVS 3D) is the market leader in the provision of interactive 3D visualization and analysis software for marine information. The Fledermaus software suite enables commercial, academic and military clients mapping the oceans to interact with massive geographical datasets of numerous data types. Summary Provided By: http://www.ivs3d.com/companyinfo/about_ivs.html

COMMERCIAL
type: Concept