ELECTRICAL CONDUCTIVITY
type: Concept
in scheme: sciencekeywords
definition: A measure of ease with which a conduction current can be caused to flow through soil under the influence of an applied electric field. It is the reciprocal of resistivity and is measured in mhos per meter.

SOILS
type: Concept