HCRN
type: Concept
in scheme: providers
definition: The Hawai'i Coral Reef Network (HCRN) is a grass-roots organization of numerous individuals from a variety of state and non-governmental agencies concerned with the conservation of our precious coral reef resources. This web site is an outgrowth of the Network and an attempt to communicate our activities to as many people as possible and additionally facilitate communication among ourselves. Website: "http://www.coralreefnetwork.com/" [Summary provided by the HCRN.]

CONSORTIA/INSTITUTIONS
type: Concept