UCO/ESOC
type: Concept
in scheme: providers
change note: 2020-12-18 12:19:15.0 [sritz] Insert Concept add broader relation (UCO/ESOC [729ab1a5-8080-49df-9e02-9ad46147b070,560793] - ACADEMIC [7700280b-68ee-4644-bf5e-84e7a6adf897,533815]);
change note: 2020-12-18 12:22:47.0 [sritz] insert AltLabel (id: null category: primary text: Earth Science & Observation Center, The University of Colorado at Boulder language code: en); insert Definition (id: null text: The Earth Science and Observation Center (ESOC), at the Cooperative Institute for Research in Environmental Science (CIRES), is a research center dedicated to the understanding of the Earth System, primarily – but not exclusively - through the use of remote sensing techniques. More information: http://cires.colorado.edu/esoc/ language code: en); insert Resource (id: null type: provider url: http://cires.colorado.edu/esoc/);
definition: The Earth Science and Observation Center (ESOC), at the Cooperative Institute for Research in Environmental Science (CIRES), is a research center dedicated to the understanding of the Earth System, primarily – but not exclusively - through the use of remote sensing techniques. More information: http://cires.colorado.edu/esoc/

ACADEMIC
type: Concept