V - Z
type: Concept

VARS
type: Concept
in scheme: projects
definition: The Video Annotation and Reference System (VARS) is a software interface and database system that provides tools for describing, cataloging, retrieving, and viewing the visual, descriptive, and quantitative data associated with video. Developed by the Monterey Bay Aquarium Research Institute (MBARI) for annotating deep-sea video data, VARS is currently being used to describe over 4500 dives by our remotely operated vehicles (ROV). VARS has allowed MBARI scientists to produce numerous quantitative and qualitative scientific publications based on video data. http://vars.sourceforge.net/