SOILS
type: Concept

CALCIUM
type: Concept
change note: 2021-09-01 09:46:53.0 [tstevens] update Definition (United States Department of Agriculture);
in scheme: sciencekeywords
definition: Any measurement of Calcium in any form in the soil, such as CaCO3.