SPAS-II
type: Concept
change note: 2021-11-30 12:28:31.0 [tstevens] Move Concepts delete broader relation (null); add broader relation (SPAS-II [73fef640-5d7a-4798-93d3-a97b712287a2,826378] - SPACE SHUTTLE [3ef93fbf-1e19-42a9-a91f-502d125dbb7c,826168]);
change note: 2021-11-30 12:14:10.0 [tstevens] Move Concepts delete broader relation (null); add broader relation (SPAS-II [73fef640-5d7a-4798-93d3-a97b712287a2,826378] - Space Stations/Crewed Spacecraft [388e72a1-b851-4b78-9e69-747e06ae215f,826132]);
change note: 2021-11-30 12:09:03.0 [tstevens] Move Concepts delete broader relation (null); add broader relation (SPAS-II [73fef640-5d7a-4798-93d3-a97b712287a2,826378] - Space-based Platforms [b39a69b4-c3b9-4a94-b296-bbbbe5e4c847,835875]);
in scheme: platforms
definition: The SPAS (Shuttle Pallet Satellite) satellite was a reusable free-flying vehicle built by Messerschmitt-Bolkow-Blohm.which could be deployed and then retrieved by the US Space Shuttle's Remote Manipulator System arm. The original SPAS, with materials processing and SDI-related sensor payloads, was used on several missions (STS-7, STS-11, STS-39). An experiment-carrying truss (USS) based on the original SPAS structure (but without the avionics and attitude control) was flown on the Spacelab D-1 and D-2 missions. The shuttle was launched on April 28, 1991 and landed May 6, 1991. Unclassified payload included the Infrared Background Signature Survey (IBSS) with Critical Ionization Velocity (CIV), Chemical Release Observation (CRO) and Shuttle Pallet Satellite-II (SPAS-II) experiments; and Space Test Payload-1 (STP-1). Classified payload consisted of Multi-Purpose Release Canister (MPEC). Also on board was Radiation Monitoring Equipment III (RME III) and Cloud Logic to Optimize Use of Defense Systems-1A (CLOUDS-1). [Summary provided by NASA] Group: Platform_Details Entry_ID: SPAS-II Group: Platform_Identification Platform_Category: Space Stations/Manned Spacecraft Platform_Series_or_Entity: SPACE SHUTTLE Short_Name: SPAS-II Long_Name: Shuttle Pallet Satellite-II End_Group Group: Synonymous_Platform_Names Short_Name: ORFEUS II End_Group Creation_Date: 2008-01-25 Online_Resource: http://www-pao.ksc.nasa.gov/kscpao/chron/sts-39.htm Group: Platform_Logistics Launch_Date: 1991-04-28 Primary_Sponsor: NASA End_Group End_Group

Space Shuttle
type: Concept