TROPICAL CYCLONES
type: Concept

TROPICAL DEPRESSION FREQUENCY
type: Concept
change note: 2016-07-31 17:37:21.0 [saritz] Insert Concept add broader relation (TROPICAL DEPRESSION FREQUENCY [74aac882-80ae-4ecd-9585-c541cd7a10fc,247475] - TROPICAL DEPRESSION [3e7a4686-8255-4046-ab3a-b2da5e450aed,217785]);
change note: 2016-07-31 21:44:08.0 [saritz] update Definition (Number of Tropical Depressions per unit time.);
change note: 2016-07-31 21:43:27.0 [saritz] insert Definition (id: null text: Number of Subtropical Cyclones per unit time. language code: en);
change note: 2016-07-31 17:41:59.0 [saritz] Move Concepts delete broader relation (null); add broader relation (TROPICAL DEPRESSION FREQUENCY [74aac882-80ae-4ecd-9585-c541cd7a10fc,247475] - TROPICAL CYCLONES [06180441-d4bb-4fed-b36a-9b3cb2cac0fe,217775]);
change note: 2016-07-31 21:43:46.0 [saritz] update Definition (Number of Tropical Cyclones per unit time.);
in scheme: sciencekeywords
definition: Number of Tropical Depressions per unit time.