UB/SGS/BRIDGE
type: Concept
in scheme: providers
definition: The School of Geographical Sciences is currently a 6* department having been continuously top ranked by the UK funding council HEFCE’s Research Assessment Exercise. The School's research is focussed on a number of themes which take due cognisance of UK Research Council priority areas, industrial and other stakeholder interests. Summary Provided By: http://www.ggy.bris.ac.uk/research

ACADEMIC
type: Concept