X-Ray/Gamma Ray Detectors
type: Concept

SSB/X2
type: Concept
in scheme: instruments
definition: [Source: National Space Science Data Center, http://nssdc.gsfc.nasa.gov/nmc/experimentDisplay.do?id=1994-057A-06 ] This is an array-based system that detects the location, intensity, and spectrum of X-rays emitted from the earth's atmosphere. Group: Instrument_Details Entry_ID: SSB/X2 Group: Instrument_Identification Instrument_Category: Solar/Space Observing Instruments Instrument_Class: X-Ray/Gamma Ray Detectors Short_Name: SSB/X2 Long_Name: Advanced X-Ray Detector (SSB/X2) End_Group Group: Associated_Platforms Short_Name: DMSP 5D-2/F12 Short_Name: DMSP 5D-2/F13 Short_Name: DMSP 5D-2/F14 End_Group Group: Spectral_Frequency_Information Wavelength_Keyword: X-Ray End_Group Online_Resource: http://nssdc.gsfc.nasa.gov/nmc/experimentDisplay.do?id=1994-057A-06 Creation_Date: 2008-10-17 Group: Instrument_Logistics Instrument_Owner: Department of Defense-Department of the Air Force (United States) End_Group End_Group