OYSTER REEF
type: Concept
change note: 2016-06-14 11:37:50.0 [gee-cee] insert Definition (id: null text: Pertaining to a reef formed of shells from successive generations of oysters. language code: en);
change note: 2016-06-14 11:37:30.0 [gee-cee] Insert Concept add broader relation (OYSTER REEF [758c00c3-03a3-4cef-9248-ab392d789148,188235] - REEF HABITAT [367718c8-cc3b-4c94-a270-0a278afabb43,84267]);
in scheme: sciencekeywords
definition: Pertaining to a reef formed of shells from successive generations of oysters.

REEF
type: Concept