DOC/NOAA/NWS/FSD
type: Concept
in scheme: providers
definition: The Climatic Archives at the National Weather Service forecast Office in Sioux Falls, South Dakota contain climate data sets for stations in South Dakota, Iowa, and Minnesota. Website: "http://www.crh.noaa.gov/fsd/" [Summary provided by NOAA]

NOAA
type: Concept