TROPICAL DEPRESSION TRACK
type: Concept
change note: 2016-07-31 21:46:29.0 [saritz] insert Definition (id: null text: Tropical Depression path, route, or course. language code: en);
change note: 2016-07-31 17:42:10.0 [saritz] Move Concepts delete broader relation (null); add broader relation (TROPICAL DEPRESSION TRACK [75c369df-2b9f-4328-8b1f-325d83ffb4cf,247477] - TROPICAL CYCLONES [06180441-d4bb-4fed-b36a-9b3cb2cac0fe,217775]);
change note: 2016-07-31 17:37:59.0 [saritz] Insert Concept add broader relation (TROPICAL DEPRESSION TRACK [75c369df-2b9f-4328-8b1f-325d83ffb4cf,247477] - TROPICAL DEPRESSION [3e7a4686-8255-4046-ab3a-b2da5e450aed,217785]);
in scheme: sciencekeywords
definition: Tropical Depression path, route, or course.

TROPICAL CYCLONES
type: Concept