HYDROLOGICAL HAZARDS MAPPING
type: Concept
change note: 2019-07-25 09:35:28.0 [tstevens] Insert Concept add broader relation (HYDROLOGICAL HAZARDS MAPPING [764e3842-9c3c-4d01-a390-fbccfaa81884,368991] - HAZARD MAPPING [c9a13e09-98de-4ace-8d4c-b01aa04347f4,368979]);
alternative label: HYDROLOGIC HAZARDS MAPPING
in scheme: sciencekeywords
definition: Mapping of ​hazards caused by the occurrence, movement, or distribution of surface and subsurface freshwater and saltwater. Examples include flooding, drought, mudslides, and avalanches.

HAZARD MAPPING
type: Concept