MUDFLAT
type: Concept
change note: 2016-06-13 13:44:48.0 [gee-cee] insert Definition (id: null text: Pertaining to a mud area with less than 5% vegetative cover. language code: en);
change note: 2016-06-13 13:44:15.0 [gee-cee] Insert Concept add broader relation (MUDFLAT [771b2919-ab55-4c71-8561-b4fb365da53f,188217] - COASTAL HABITAT [47be68db-d10d-43e7-b150-61cfd3f06126,84259]);
in scheme: sciencekeywords
definition: Pertaining to a mud area with less than 5% vegetative cover.

COASTAL
type: Concept