GATECH/GTRI
type: Concept
in scheme: providers
definition: Georgia Tech Research Institute (GTRI) is the nonprofit applied research arm of the Georgia Institute of Technology in Atlanta, GA. Our approximately 1,200 employees perform or support more than $100 million in research yearly for more than 200 clients in industry and government. Our commitment? Creating solutions through innovation, on time and on budget. We assist clients in federal, state, local and international government agencies, industrial firms, academic institutions and private organizations. More than 70 percent of our research personnel hold advanced degrees, and all are committed to an independent, unbiased approach to solving problems. We also offer our association with Georgia Institute of Technology colleagues who can contribute additional talent and knowledge for meeting technological and engineering challenges. Website: http://www.gtri.gatech.edu/about/ info: Georgia Institute of Technology

ACADEMIC
type: Concept