Pressure/Height Meters
type: Concept

SCHOLANDER PRESSURE CHAMBER
type: Concept
in scheme: instruments
definition: A scholander pressure chamber is used to pressurize leaves and leafy twigs and estimate leaf water potential from the balancing pressure required to force water back to the cut stem surface.