THESEO
type: Concept
in scheme: projects
definition: THESEO 2000 (Third European Stratospheric Experiment on Ozone - 2000) is a pan-European activity consisting of THESEO projects funded in the EC's Environment programmes (in both the 4th and 5th Framework programmes) and a number of projects funded through the national programmes in Europe. It encompasses measurements from aircraft, balloons, ozonesondes, ground-based station and satellites. THESEO-2000 opertes in collaboration with the NASA SAGE III Ozone Loss and Validation Experiment (SOLVE). For more information on THESEO 2000, see: "http://www.nilu.no/projects/theseo2000" For information on SOLVE, see: "http://cloud1.arc.nasa.gov/solve/"

S - U
type: Concept