STREAMFLOW RECONSTRUCTION
type: Concept
in scheme: sciencekeywords
definition: Reconstruction of past streamflow conditions based on paleoclimate proxy records (related to drought/precipitation records).

PALEOCLIMATE RECONSTRUCTIONS
type: Concept