MARINE MAGNETICS
type: Concept
in scheme: sciencekeywords
definition: Pertaining to the measurement of the Earth's magnetic field through the world's oceans to detect variances in the oceanic crust.

MARINE GEOPHYSICS
type: Concept