MARINE GEOPHYSICS
type: Concept

PLATE TECTONICS
type: Concept
in scheme: sciencekeywords
definition: A theory of global tectonics in which the lithosphere is divided into a number of plates whose pattern of horizontal movement is that of torsionally rigid bodies that interact with one another at their boundaries, causing seismic and tectonic activity along these boundaries.