USP/IO
type: Concept
in scheme: providers
definition: The Oceanographic Institute at the University of Sao Paulo (lO-USP) was founded in 1946, as Paulista Institute of Oceanography. In 1951 she moved to its current name when it was incorporated to USP. At the time of foundation, the objectives of its idealizadores pointed to the need for an institution to provide a scientific basis for fishing and, in a broader conception, the exploitation of all available resources along the coast Paulista. Summary Provided By: http://translate.google.com/translate?hl=en&sl=pt&u=http://www.io.usp.br/&sa=X&oi=translate&resnum=1&ct=result&prev=/search%3Fq%3DInstitituto%2BOceanografico,%2BUniversidade%2Bde%2BSao%2BPaulo%26hl%3Den%26client%3Dfirefox-a%26channel%3Ds%26rls%3Dorg.mozilla:en-US:official%26hs%3Dw30%26sa%3DG

ACADEMIC
type: Concept