UT/CLIM
type: Concept
in scheme: providers
definition: The Utah Climate Center in association with the National Climatic Data Center (NCDC) offers an extensive global database of surface weather observations. This data can be obtained via the Utah Climate Center's on-line data retrieval system. "http://climate.usu.edu/"

UTAH
type: Concept