WATERLOO/GEM
type: Concept
change note: 2018-04-04 14:51:56.0 [mmorahan] insert AltLabel (id: null category: primary text: https://uwaterloo.ca/geography-environmental-management/ language code: en); insert Definition (id: null text: The Department of Geography and Environmental Management (GEM) is one of the leading geography departments in Canada with a strong commitment to the discovery, dissemination, and application of geographic knowledge focused on the complex interactions within and between the human and natural environments. The Department embraces a three-fold mission of excellence in research, excellence in research-led teaching in all undergraduate and graduate degree programmes, and celebration of, and respect for all, members of the Department, Faculty of Environment, and the University of Waterloo. Fundamentally, our research falls into four broad areas: Climate Change Development and Environment Earth Systems Science Geomatics language code: en);
change note: 2018-04-04 14:41:25.0 [mmorahan] Insert Concept add broader relation (WATERLOO/GEM [79ef7df8-12fe-4d55-b90c-572266091e63,367463] - ACADEMIC [7700280b-68ee-4644-bf5e-84e7a6adf897,337181]);
change note: 2018-04-04 14:52:38.0 [mmorahan] update AltLabel (Department of Geography and Environmental Management, The University of Waterloo);
in scheme: providers
definition: The Department of Geography and Environmental Management (GEM) is one of the leading geography departments in Canada with a strong commitment to the discovery, dissemination, and application of geographic knowledge focused on the complex interactions within and between the human and natural environments. The Department embraces a three-fold mission of excellence in research, excellence in research-led teaching in all undergraduate and graduate degree programmes, and celebration of, and respect for all, members of the Department, Faculty of Environment, and the University of Waterloo. Fundamentally, our research falls into four broad areas: Climate Change Development and Environment Earth Systems Science Geomatics

ACADEMIC
type: Concept