ACADEMIC
type: Concept

AZ-STATE/HPC
type: Concept
change note: 2013-06-03 09:22:28.0 [tbs1979] insert AltLabel (id: null text: Advanced Computing Center, Arizona State University language code: en);
change note: 2013-06-03 09:21:48.0 [tbs1979] Insert Concept add broader relation (AZ-STATE/HPC [79f270de-733b-4434-a9ed-1a8dc6f486d7,105181] - ACADEMIC [7700280b-68ee-4644-bf5e-84e7a6adf897,66467]);
in scheme: providers
definition: The Advanced Computing Center at Arizona State University provides transformative advanced computing solutions, in a cost-effective manner, to support the University’s mission and goals as they apply to research, education, and public service.