Chemical Meters/Analyzers
type: Concept

AUTOANALYZER
type: Concept
change note: 2021-08-04 17:51:27.0 [sritz] insert AltLabel (id: null category: primary text: AUTOANALYZER language code: en);
in scheme: instruments
definition: An AutoAnalyzer provides a testing and software maintenance environment for software engineers. Builds an interactive structure chart of source code, traces use of global variables, measures and displays test coverage analysis, performance information. [Summary provided by NOAA]