CONSORTIA/INSTITUTIONS
type: Concept

TTRS
type: Concept
in scheme: providers
definition: Tall Timbers celebrates its 50th Anniversary in 2008. As we reflect on the many accomplishments over the past 50 years that have furthered our mission, we are also looking ahead to the next 50 years of wildlife and wildland stewardship. Tall Timbers is a widely regarded information resource for the areas of fire ecology, game bird management, vertebrate ecology and forestry. The Research Station is recognized as the home of the study of fire ecology and is an advocate to protect the right to use prescribed fire for land management. And, the Land Conservancy is recognized as one of the nation’s leading land trusts, as it has protected traditional land uses in north Florida and south Georgia by conserving more than 100,000 acres in this region through conservation easements. Summary Provided By: http://www.talltimbers.org/welcome.html