MWHS-2
type: Concept
in scheme: instruments
definition: The MicroWave Humidity Sounder 2 (MWHS-2) is an important instrument onboard FengYun-3C (FY-3C), the first operational satellite in a series of the second generation of polar-orbiting operational meteorological satellites of China. MWHS-2 was designed for observing the distribution of global atmospheric thermodynamics information, and monitoring the severe convective systems such as typhoon and rainstorm in all-weather conditions. Assimilation of MWHS-2 will improve the analysis of atmospheric humidity and temperature fields required for numerical weather prediction (NWP).
change note: 2021-10-12 16:36:17.0 [sritz] Insert Concept add broader relation (MWHS-2 [7a5db0f9-054b-41c8-a49e-75b704d28669,763850] - Profilers/Sounders [4190ebdc-e89a-4f3f-bc74-b2af4c68d009,755422]);
change note: 2021-10-12 16:38:50.0 [sritz] update Definition (https://fy4.nsmc.org.cn/nsmc/en/instrument/MWHS-2.html https://space.oscar.wmo.int/instruments/view/mwhs_2);
change note: 2021-10-12 16:38:23.0 [sritz] insert AltLabel (id: null category: primary text: MicroWave Humidity Sounder - 2 language code: en); insert Definition (id: null text: The MicroWave Humidity Sounder 2 (MWHS-2) is an important instrument onboard FengYun-3C (FY-3C), the first operational satellite in a series of the second generation of polar-orbiting operational meteorological satellites of China. MWHS-2 was designed for observing the distribution of global atmospheric thermodynamics information, and monitoring the severe convective systems such as typhoon and rainstorm in all-weather conditions. Assimilation of MWHS-2 will improve the analysis of atmospheric humidity and temperature fields required for numerical weather prediction (NWP). language code: en);

Profilers/Sounders
type: Concept