IT/MNA
type: Concept
definition: The Italian Museo Nazionale dell’Antartide was established in 1996 by the Minister of University and Research, as a consortium of three universities (Genova, Siena, Trieste) with the aim to give support to the scientific activities of the Italian National Antarctic Research Programme and favour the dissemination of the scientific results. Its tasks are to curate, study, and increase the value of all scientific material collected during the Italian Antarctic expeditions, as well as to promote public understanding of Antarctic science and the knowledge of scientific results achieved by the Italian Antarctic research community. The scientific material includes thousands of specimens of rocks, meteorites, terrestrial and marine organisms, thousands of meters of sediment and ice cores, and many environmental specimens. The material is appropriately stored, recorded in public databases and available to the national and international scientific communities. The Museum has a rich polar library including books, journals, geographic and thematic maps, movies and slides concerning polar regions and science. To promote the knowledge of the Antarctic continent, permanent exhibitions are held in the three sections of the Museum.
change note: 2021-07-19 07:50:44.0 [tstevens] insert Definition (id: null text: The Italian Museo Nazionale dell’Antartide was established in 1996 by the Minister of University and Research, as a consortium of three universities (Genova, Siena, Trieste) with the aim to give support to the scientific activities of the Italian National Antarctic Research Programme and favour the dissemination of the scientific results. Its tasks are to curate, study, and increase the value of all scientific material collected during the Italian Antarctic expeditions, as well as to promote public understanding of Antarctic science and the knowledge of scientific results achieved by the Italian Antarctic research community. The scientific material includes thousands of specimens of rocks, meteorites, terrestrial and marine organisms, thousands of meters of sediment and ice cores, and many environmental specimens. The material is appropriately stored, recorded in public databases and available to the national and international scientific communities. The Museum has a rich polar library including books, journals, geographic and thematic maps, movies and slides concerning polar regions and science. To promote the knowledge of the Antarctic continent, permanent exhibitions are held in the three sections of the Museum. language code: en);
change note: 2021-07-19 07:44:18.0 [tstevens] Insert Concept add broader relation (IT/MNA [7a61c803-ad9a-4657-a8ca-2a5491bee270,678047] - ITALY [e0f9be30-793f-463e-adc1-c8bedb8bc4f1,664760]);
change note: 2021-07-19 07:46:41.0 [tstevens] insert AltLabel (id: null category: primary text: Museo Nazionale dell’Antartide, Italy language code: en);
in scheme: providers

ITALY
type: Concept