EPA/OW/OGWDW
type: Concept
in scheme: providers
definition: The Office of Ground Water and Drinking Water (OGWDW), together with states, tribes, and its many partners, protects public health by ensuring safe drinking water and protecting ground water. OGWDW, along with EPA's ten regional drinking water programs, oversees implementation of the Safe Drinking Water Act, which is the national law safeguarding tap water in America. Website: "http://www.epa.gov/safewater/" [Summary provided by the EPA.]

EPA
type: Concept