MSU-MR
type: Concept
change note: 2015-08-03 13:05:06.0 [mpmorahan] insert AltLabel (id: null text: Low-resolution multispectral scanning imager-radiometer language code: en);
change note: 2015-08-03 13:03:55.0 [mpmorahan] Insert Concept add broader relation (MSU-MR [7adab01b-cdf2-4e08-9844-23604b6e07eb,158175] - Imaging Spectrometers/Radiometers [944b7691-af37-4fb4-9393-c114e7997829,144651]);
in scheme: instruments
definition: Low-resolution multispectral scanning imager-radiometer (MSU-MR) Group: Instrument_Details Entry_ID: MSU-MR Group: Instrument_Identification Instrument_Category: Earth Remote Sensing Instruments Instrument_Class: Passive Remote Sensing Instrument_Type: Spectrometers/Radiometers Instrument_Subtype: Imaging Spectrometers/Radiometers Short_Name: MSU-MR Long_Name: Low-resolution multispectral scanning imager-radiometer End_Group Group: Associated_Platforms Short_Name: Meteor-3M Short_Name: Meteor-M N1 Short_Name: Meteor-M N2 End_Group Group: Spectral_Frequency_Information Wavelength_Keyword: Visible Spectral_Frequency_Coverage_Range: 0.5 µm - 0.7 µm End_Group Group: Spectral_Frequency_Information Wavelength_Keyword: Visible Spectral_Frequency_Coverage_Range: 0.7 µm - 1.1 µm End_Group Group: Spectral_Frequency_Information Wavelength_Keyword: Near Infrared Spectral_Frequency_Coverage_Range: 0.7 µm - 1.1 µm End_Group Group: Spectral_Frequency_Information Spectral_Frequency_Coverage_Range: 1.6 µm - 1.8 µm End_Group Group: Spectral_Frequency_Information Wavelength_Keyword: Infrared > Thermal Spectral_Frequency_Coverage_Range: 3.5 µm - 4.1 µm End_Group Group: Spectral_Frequency_Information Wavelength_Keyword: Infrared > Thermal Spectral_Frequency_Coverage_Range: 10.5 µm - 11.5 µm End_Group Group: Spectral_Frequency_Information Wavelength_Keyword: Infrared > Thermal Spectral_Frequency_Coverage_Range: 11.5 µm - 12.5 µm End_Group Online_Resource: http://gis-lab.info/projects/ss/sensor/meteor_msu-mr.html Online_Resource: http://www.wmo-sat.info/oscar/instruments/view/326 Sample_Image: http://s017.radikal.ru/i435/1506/17/c8ca69ecfc57.jpg Creation_Date: 2015-01-26 Group: Instrument_Logistics Instrument_Owner: Russia/ROSCOSMOS End_Group End_Group

Imaging Spectrometers/Radiometers
type: Concept