VEGETATION
type: Concept

VEGETATION WATER POTENTIAL
type: Concept
change note: 2020-11-05 13:21:18.0 [tstevens] Insert Concept add broader relation (VEGETATION WATER POTENTIAL [7b4a6b86-6a74-4b01-b0ee-a9d7d60c72cb,560751] - VEGETATION [c7b5c02c-724d-4a19-b824-98180f3900c9,83709]);
in scheme: sciencekeywords
definition: Water potential is defined by its chemical activity or free energy.