EPA
type: Concept

EPA/EEC
type: Concept
in scheme: providers
definition: Our Mission The mission of the Environmental Protection Agency is to protect human health and the environment. Since 1970, EPA has been working for a cleaner, healthier environment for the American people. View the Agency's complete strategic plan, annual report, and policy resources. Summary provided by http://www.epa.gov/epahome/aboutepa.htm