CA/AGR/ECORC
type: Concept
change note: 2015-02-25 15:19:29.0 [epneff] Updated Data Center URL update Definition (The Canadian Soil Information Systems group of The Eastern Cereal and Oilseed Research Centre, Research Branch , Agriculture and Agri-Food Canada provides access to state of the art GIS facilities, as well as database management and custom mapping services for the Canadian Land Resource Network. These services are also available to outside of Research Branch on a fee for service basis. More Information: "http://www.agr.gc.ca/eng/science-and-innovation/research-centres/ontario/eastern-cereal-and-oilseed-research-centre/?id=1180546650582");
in scheme: providers
definition: The Canadian Soil Information Systems group of The Eastern Cereal and Oilseed Research Centre, Research Branch , Agriculture and Agri-Food Canada provides access to state of the art GIS facilities, as well as database management and custom mapping services for the Canadian Land Resource Network. These services are also available to outside of Research Branch on a fee for service basis. More Information: "http://www.agr.gc.ca/eng/science-and-innovation/research-centres/ontario/eastern-cereal-and-oilseed-research-centre/?id=1180546650582"

CANADA
type: Concept