NSF
type: Concept

UCAR/NCAR/CISL/RDA
type: Concept
change note: 2017-12-06 14:32:17.0 [sritz] update Resource (provider); update Resource (https://rda.ucar.edu/);
change note: 2013-05-24 12:08:41.0 [saritz] Updated data center name. update AltLabel (Research Data Archive, Computational and Information Systems Laboratory, National Center for Atmospheric Research, University Corporation for Atmospheric Research); update PrefLabel (UCAR/NCAR/CISL/RDA);
in scheme: providers
definition: The NCAR CISL Research Data Archive is part of the Scientific Computing Division at the National Center for Atmospheric Research in Boulder, Colorado. NCAR operates under the sponsorship of the National Science Foundation. DATA SERVICES Data services will vary across our dataset holdings, but many of our sets can be subsetted (e.g. provide specific times, stations, grids), reformatted (e.g. provide the data in a standard format or human-readable ASCII), and used to derive new products (e.g. monthly means of daily data). Also, many of our datasets have supporting documentation and software access codes. You can get access to documentation or software for a particular dataset from the navigation bar on the dataset's web page. To find out whether or not data in a dataset can be subsetted or reformatted, contact the specialist listed on the dataset page. ACKNOWLEDING DATA PROVIDED BY DSS If you use data provided by us in published research, we request that you acknowledge the original source (or sources) of the data. This information is located on the dataset pages. We also request that you acknowledge NCAR approximately as follows: "The data were provided by the Data Support Section of the Scientific Computing Division at the National Center for Atmospheric Research. NCAR is supported by grants from the National Science Foundation."